{"text_format":"1","workbook":"xlsx","n_sheets":3,"sheets":["SampleColours","Sample","HeatMap"],"not_rendered":{"charts":0,"images":2,"macros":1,"external_links":0,"defined_names":1,"comments":0,"pivot_tables":0},"unopened":[],"bounds":{"document_bytes":16777216,"sheet_cells":100000,"rows_first":2000,"rows_last":500,"rows_between":2000,"halvings":0,"cell_chars":16384,"cell_head_chars":4096},"cells_cut":0,"cells_raw":0,"read":"whole","date_system":"1900"}

{"sheet":"SampleColours","index":0,"n_rows":41,"n_cols":4,"rows_kept":41,"cut":false,"hidden":false,"merged":[]}
["Colour","Red","Green","Blue"]
["Black",0,0,0]
["Lightorange",255,153,0]
["Lime",153,204,0]
["Gold",255,204,0]
["Brightgreen",0,255,0]
["Yellow",255,255,0]
["Grey 80%",0.8,51,51]
["Darkteal",0,51,102]
["Plum",153,51,102]
["Seagreen",51,153,102]
["Darkblue",0,0,128]
["Darkred",128,0,0]
["Violet",128,0,128]
["Teal",0,128,128]
["Grey 50%",128,128,128]
["Grey 40%",150,150,150]
["Indigo",51,51,153]
["Blue-grey",102,102,153]
["Tan",255,204,153]
["Lightyellow",255,255,153]
["Grey 25%",192,192,192]
["Aqua",51,204,204]
["Red",255,0,0]
["Rose",255,153,204]
["Lightgreen",204,255,204]
["Blue",0,0,255]
["Pink",255,0,255]
["Lightblue",51,102,255]
["Lavender",204,153,255]
["Skyblue",0,204,255]
["Paleblue",153,204,255]
["Turquoise",0,255,255]
["Lightturquoise",204,255,255]
["Darkgreen",0,51,0]
["White",255,255,255]
["Olivegreen",51,51,0]
["Brown",153,51,0]
["Orange",255,102,0]
["Green",0,128,0]
["Darkyellow",128,128,0]

{"sheet":"Sample","index":1,"n_rows":7,"n_cols":8,"rows_kept":7,"cut":false,"hidden":false,"merged":[]}
[null,"State","Red","Green","Blue",null,"Choice"]
[1,"Blue",0,51,102,null,"Blue",1]
[2,"Light Blue",100,150,400,null,"Red",3]
[3,"Light Red",50,0,0,null,"Green",5]
[4,"Red",150,0,0]
[5,"Green",10,100,50]
[6,"Olive",216,228,188]

{"sheet":"HeatMap","index":2,"n_rows":19,"n_cols":7,"rows_kept":19,"cut":false,"hidden":false,"merged":[]}
[]
[]
[]
[]
[]
[]
[]
[]
[]
[null,null,null,null,null,null,"Red"]
[null,"Colour","Red","Green","Blue",{"$f":"VLOOKUP(G10,Sample!$G$2:$H$4,2,0)","v":3}]
[null,"VIC",{"$f":"VLOOKUP($F$11,Sample!$A$2:$E$7,COLUMN(),0)","v":50},{"$f":"VLOOKUP($F$11,Sample!$A$2:$E$7,COLUMN(),0)","v":0},{"$f":"VLOOKUP($F$11,Sample!$A$2:$E$7,COLUMN(),0)","v":0}]
[null,"NSW",{"$f":"VLOOKUP($F$11+1,Sample!$A$2:$E$7,COLUMN(),0)","v":150},{"$f":"VLOOKUP($F$11+1,Sample!$A$2:$E$7,COLUMN(),0)","v":0},{"$f":"VLOOKUP($F$11+1,Sample!$A$2:$E$7,COLUMN(),0)","v":0}]
[null,"QLD",{"$f":"VLOOKUP($F$11,Sample!$A$2:$E$7,COLUMN(),0)","v":50},{"$f":"VLOOKUP($F$11,Sample!$A$2:$E$7,COLUMN(),0)","v":0},{"$f":"VLOOKUP($F$11,Sample!$A$2:$E$7,COLUMN(),0)","v":0}]
[null,"NT",{"$f":"VLOOKUP($F$11+1,Sample!$A$2:$E$7,COLUMN(),0)","v":150},{"$f":"VLOOKUP($F$11+1,Sample!$A$2:$E$7,COLUMN(),0)","v":0},{"$f":"VLOOKUP($F$11+1,Sample!$A$2:$E$7,COLUMN(),0)","v":0}]
[null,"SA",{"$f":"VLOOKUP($F$11,Sample!$A$2:$E$7,COLUMN(),0)","v":50},{"$f":"VLOOKUP($F$11,Sample!$A$2:$E$7,COLUMN(),0)","v":0},{"$f":"VLOOKUP($F$11,Sample!$A$2:$E$7,COLUMN(),0)","v":0}]
[null,"WA",{"$f":"VLOOKUP($F$11+1,Sample!$A$2:$E$7,COLUMN(),0)","v":150},{"$f":"VLOOKUP($F$11+1,Sample!$A$2:$E$7,COLUMN(),0)","v":0},{"$f":"VLOOKUP($F$11+1,Sample!$A$2:$E$7,COLUMN(),0)","v":0}]
[null,"ACT",{"$f":"VLOOKUP($F$11,Sample!$A$2:$E$7,COLUMN(),0)","v":50},{"$f":"VLOOKUP($F$11,Sample!$A$2:$E$7,COLUMN(),0)","v":0},{"$f":"VLOOKUP($F$11,Sample!$A$2:$E$7,COLUMN(),0)","v":0}]
[null,"TAS",{"$f":"VLOOKUP($F$11+1,Sample!$A$2:$E$7,COLUMN(),0)","v":150},{"$f":"VLOOKUP($F$11+1,Sample!$A$2:$E$7,COLUMN(),0)","v":0},{"$f":"VLOOKUP($F$11+1,Sample!$A$2:$E$7,COLUMN(),0)","v":0}]