{"text_format":"1","workbook":"xlsx","n_sheets":5,"sheets":["Model","States","Data","Calcs","Summary"],"not_rendered":{"charts":7,"images":86,"macros":0,"external_links":0,"defined_names":71,"comments":1,"pivot_tables":0},"unopened":[],"bounds":{"document_bytes":16777216,"sheet_cells":100000,"rows_first":2000,"rows_last":500,"rows_between":2000,"halvings":0,"cell_chars":16384,"cell_head_chars":4096},"cells_cut":0,"cells_raw":0,"read":"whole","date_system":"1900"}

{"sheet":"Model","index":0,"n_rows":7,"n_cols":5,"rows_kept":7,"cut":false,"hidden":false,"merged":[]}
[null,"Sheets","Sheet Type","Description","Links"]
[null,"Model","Assumptions","Description of Sheets",{"$f":"HYPERLINK(\"#\"&B2&\"!A2\",B2)","v":"Model"}]
[null,"List","Assumptions","Lists and model assumptions",{"$f":"HYPERLINK(\"#\"&B3&\"!A2\",B3)","v":"List"}]
[null,"Data","Input Sheet","Primary Inputs Sheet","Data"]
[null,"Calcs","Calculations sheet","Primary calculations page","Calcs"]
[null,"Check","Error trapping","Checks and balances for the model","Check"]
[null,"Summary","Output Sheet","Primary output page","Summary"]

{"sheet":"States","index":1,"n_rows":51,"n_cols":5,"rows_kept":51,"cut":false,"hidden":false,"merged":[]}
["No","State","NameRng","FullName","Region"]
[1,null,"Alabama","Alabama","The South"]
[2,null,"Alaska","Alaska","The West"]
[3,null,"Arizona","Arizona","The West"]
[4,null,"Arkansas","Arkansas","The South"]
[5,null,"California","California","The West"]
[6,null,"Colorado","Colorado","The West"]
[7,null,"Connecticut","Connecticut","The North-East"]
[8,null,"Delaware","Delaware","The North-East"]
[9,null,"Florida","Florida","The South"]
{"$rows_left_out":42}
{"sheet":"Data","index":2,"n_rows":51,"n_cols":21,"rows_kept":51,"cut":false,"hidden":false,"merged":[]}
["Index","State","Region","Pop 1 Jul 12","Pop April 1, 2010","Pop April 1, 2000","% of US","Population Density","Tax Revenue","Expenses","Unemployment","Pop Rank","Density Rank","Rev Rank","Exp Rank","Unemployment Rank","Pop Rank Reg","Density Rank Reg","Rev Rank","Exp Rank","Unemployment Rank Reg"]
[1,"California",{"$f":"VLOOKUP(B2,States!$D$2:$E$51,2,0)","v":"The West"},38041430,37253956,33871648,0.1191,244.2,292563574000,435914805277.5,8.6999999999999994E-2,{"$f":"RANK(D2,D$2:D$51)+COUNTIF(D$2:D2,D2)-1","v":1},{"$f":"RANK(H2,H$2:H$51)+COUNTIF(H$2:H2,H2)-1","v":10},{"$f":"RANK(I2,I$2:I$51)+COUNTIF(I$2:I2,I2)-1","v":1},{"$f":"RANK(J2,J$2:J$51)+COUNTIF(J$2:J2,J2)-1","v":1},{"$f":"RANK(K2,K$2:K$51)+COUNTIF(K$2:K2,K2)-1","v":5},{"$f":"SUMPRODUCT((C$2:C$601=$C2)*(D$2:D$601>D2))+1","v":1},{"$f":"SUMPRODUCT((C$2:C$601=$C2)*(H$2:H$601>H2))+1","v":1},{"$f":"SUMPRODUCT(($C$2:$C$601=$C2)*(I$2:I$601>I2))+1","v":1},{"$f":"SUMPRODUCT(($C$2:$C$601=$C2)*(I$2:I$601>I2))+1","v":1},{"$f":"COUNTIFS($C:$C,$C2,$K:$K,\">\"&$K2)+COUNTIFS($C$2:$C2,$C2,$K$2:$K2,$K2)","v":2}]
[2,"Texas",{"$f":"VLOOKUP(B3,States!$D$2:$E$51,2,0)","v":"The South"},26059203,25145561,20851820,8.0399999999999999E-2,98.07,219459878000,293723251710,6.2E-2,{"$f":"RANK(D3,D$2:D$51)+COUNTIF(D$2:D3,D3)-1","v":2},{"$f":"RANK(H3,H$2:H$51)+COUNTIF(H$2:H3,H3)-1","v":26},{"$f":"RANK(I3,I$2:I$51)+COUNTIF(I$2:I3,I3)-1","v":2},{"$f":"RANK(J3,J$2:J$51)+COUNTIF(J$2:J3,J3)-1","v":2},{"$f":"RANK(K3,K$2:K$51)+COUNTIF(K$2:K3,K3)-1","v":35},1,{"$f":"SUMPRODUCT((C$2:C$601=$C3)*(H$2:H$601>H3))+1","v":9},{"$f":"SUMPRODUCT(($C$2:$C$601=$C3)*(I$2:I$601>I3))+1","v":1},{"$f":"SUMPRODUCT(($C$2:$C$601=$C3)*(I$2:I$601>I3))+1","v":1},{"$f":"COUNTIFS($C:$C,$C3,$K:$K,\">\"&$K3)+COUNTIFS($C$2:$C3,$C3,$K$2:$K3,$K3)","v":11}]
[3,"New York",{"$f":"VLOOKUP(B4,States!$D$2:$E$51,2,0)","v":"The North-East"},19570261,19378102,18976457,6.1899999999999997E-2,415.3,201167954000,226137677622.5,7.6999999999999999E-2,{"$f":"RANK(D4,D$2:D$51)+COUNTIF(D$2:D4,D4)-1","v":3},{"$f":"RANK(H4,H$2:H$51)+COUNTIF(H$2:H4,H4)-1","v":6},{"$f":"RANK(I4,I$2:I$51)+COUNTIF(I$2:I4,I4)-1","v":3},{"$f":"RANK(J4,J$2:J$51)+COUNTIF(J$2:J4,J4)-1","v":3},{"$f":"RANK(K4,K$2:K$51)+COUNTIF(K$2:K4,K4)-1","v":14},1,6,{"$f":"SUMPRODUCT(($C$2:$C$601=$C4)*(I$2:I$601>I4))+1","v":1},1,{"$f":"COUNTIFS($C:$C,$C4,$K:$K,\">\"&$K4)+COUNTIFS($C$2:$C4,$C4,$K$2:$K4,$K4)","v":4}]
[4,"Florida",{"$f":"VLOOKUP(B5,States!$D$2:$E$51,2,0)","v":"The South"},19317568,18801310,15982378,6.0100000000000001E-2,360.2,122249635000,219561783927.5,6.7000000000000004E-2,{"$f":"RANK(D5,D$2:D$51)+COUNTIF(D$2:D5,D5)-1","v":4},{"$f":"RANK(H5,H$2:H$51)+COUNTIF(H$2:H5,H5)-1","v":7},{"$f":"RANK(I5,I$2:I$51)+COUNTIF(I$2:I5,I5)-1","v":5},{"$f":"RANK(J5,J$2:J$51)+COUNTIF(J$2:J5,J5)-1","v":4},{"$f":"RANK(K5,K$2:K$51)+COUNTIF(K$2:K5,K5)-1","v":25},{"$f":"SUMPRODUCT((C$2:C$601=$C5)*(D$2:D$601>D5))+1","v":2},1,2,2,{"$f":"COUNTIFS($C:$C,$C5,$K:$K,\">\"&$K5)+COUNTIFS($C$2:$C5,$C5,$K$2:$K5,$K5)","v":8}]
[5,"Illinois",{"$f":"VLOOKUP(B6,States!$D$2:$E$51,2,0)","v":"The Mid-West"},12875255,12830632,12419293,4.1000000000000002E-2,231.9,124431227000,149784245275,8.900000000000001E-2,{"$f":"RANK(D6,D$2:D$51)+COUNTIF(D$2:D6,D6)-1","v":5},{"$f":"RANK(H6,H$2:H$51)+COUNTIF(H$2:H6,H6)-1","v":11},{"$f":"RANK(I6,I$2:I$51)+COUNTIF(I$2:I6,I6)-1","v":4},{"$f":"RANK(J6,J$2:J$51)+COUNTIF(J$2:J6,J6)-1","v":5},{"$f":"RANK(K6,K$2:K$51)+COUNTIF(K$2:K6,K6)-1","v":4},{"$f":"SUMPRODUCT((C$2:C$601=$C6)*(D$2:D$601>D6))+1","v":1},2,1,1,{"$f":"COUNTIFS($C:$C,$C6,$K:$K,\">\"&$K6)+COUNTIFS($C$2:$C6,$C6,$K$2:$K6,$K6)","v":2}]
[6,"Pennsylvania",{"$f":"VLOOKUP(B7,States!$D$2:$E$51,2,0)","v":"The North-East"},12763536,12702379,12281054,4.0599999999999997E-2,285.3,108961515000,148322935565,7.4999999999999997E-2,{"$f":"RANK(D7,D$2:D$51)+COUNTIF(D$2:D7,D7)-1","v":6},{"$f":"RANK(H7,H$2:H$51)+COUNTIF(H$2:H7,H7)-1","v":8},{"$f":"RANK(I7,I$2:I$51)+COUNTIF(I$2:I7,I7)-1","v":8},{"$f":"RANK(J7,J$2:J$51)+COUNTIF(J$2:J7,J7)-1","v":6},{"$f":"RANK(K7,K$2:K$51)+COUNTIF(K$2:K7,K7)-1","v":16},2,7,3,3,{"$f":"COUNTIFS($C:$C,$C7,$K:$K,\">\"&$K7)+COUNTIFS($C$2:$C7,$C7,$K$2:$K7,$K7)","v":5}]
[7,"Ohio",{"$f":"VLOOKUP(B8,States!$D$2:$E$51,2,0)","v":"The Mid-West"},11544225,11536504,11353140,3.6900000000000002E-2,282.5,111094276000,134805820747.50002,7.4999999999999997E-2,{"$f":"RANK(D8,D$2:D$51)+COUNTIF(D$2:D8,D8)-1","v":7},{"$f":"RANK(H8,H$2:H$51)+COUNTIF(H$2:H8,H8)-1","v":9},{"$f":"RANK(I8,I$2:I$51)+COUNTIF(I$2:I8,I8)-1","v":7},{"$f":"RANK(J8,J$2:J$51)+COUNTIF(J$2:J8,J8)-1","v":7},{"$f":"RANK(K8,K$2:K$51)+COUNTIF(K$2:K8,K8)-1","v":17},2,1,2,2,{"$f":"COUNTIFS($C:$C,$C8,$K:$K,\">\"&$K8)+COUNTIFS($C$2:$C8,$C8,$K$2:$K8,$K8)","v":3}]
[8,"Georgia",{"$f":"VLOOKUP(B9,States!$D$2:$E$51,2,0)","v":"The South"},9919945,9687653,8186453,3.1E-2,172.5,65498308000,113251502525,8.1000000000000003E-2,{"$f":"RANK(D9,D$2:D$51)+COUNTIF(D$2:D9,D9)-1","v":8},{"$f":"RANK(H9,H$2:H$51)+COUNTIF(H$2:H9,H9)-1","v":17},{"$f":"RANK(I9,I$2:I$51)+COUNTIF(I$2:I9,I9)-1","v":11},{"$f":"RANK(J9,J$2:J$51)+COUNTIF(J$2:J9,J9)-1","v":9},{"$f":"RANK(K9,K$2:K$51)+COUNTIF(K$2:K9,K9)-1","v":11},3,4,3,3,{"$f":"COUNTIFS($C:$C,$C9,$K:$K,\">\"&$K9)+COUNTIFS($C$2:$C9,$C9,$K$2:$K9,$K9)","v":4}]
[9,"Michigan",{"$f":"VLOOKUP(B10,States!$D$2:$E$51,2,0)","v":"The Mid-West"},9883360,9883640,9938444,3.1600000000000003E-2,174.8,59210158000,115443467090.00002,0.09,{"$f":"RANK(D10,D$2:D$51)+COUNTIF(D$2:D10,D10)-1","v":9},{"$f":"RANK(H10,H$2:H$51)+COUNTIF(H$2:H10,H10)-1","v":16},{"$f":"RANK(I10,I$2:I$51)+COUNTIF(I$2:I10,I10)-1","v":14},{"$f":"RANK(J10,J$2:J$51)+COUNTIF(J$2:J10,J10)-1","v":8},{"$f":"RANK(K10,K$2:K$51)+COUNTIF(K$2:K10,K10)-1","v":3},3,4,4,4,{"$f":"COUNTIFS($C:$C,$C10,$K:$K,\">\"&$K10)+COUNTIFS($C$2:$C10,$C10,$K$2:$K10,$K10)","v":1}]
{"$rows_left_out":42}
{"sheet":"Calcs","index":3,"n_rows":89,"n_cols":20,"rows_kept":89,"cut":false,"hidden":false,"merged":[]}
[null,"Population",null,null,null,"Revenue",null,null,null,"Revenue",null,null,null,"Expenses",null,null,null,"Unemployment"]
["Top 10","Region","State","Population 12",null,"Region","State","Pop Density",null,"Region","State","Revenue",null,"Region","State","Expenses",null,"Region","State","Unemployment"]
[1,"The West",{"$f":"INDEX(Data!$B$2:$B$51,MATCH(1,INDEX((Data!$C$2:$C$51=B3)*(Data!$Q$2:$Q$51=A3),0),0))","v":"California"},{"$f":"SUMPRODUCT((Data!$B$2:$B$51=C3)*(Data!$C$2:$C$51=B3)*(Data!$D$2:$D$51))","v":38041430},null,"The West",{"$f":"INDEX(Data!$B$2:$B$51,MATCH(1,INDEX((Data!$C$2:$C$51=F3)*(Data!$R$2:$R$51=A3),0),0))","v":"California"},{"$f":"SUMPRODUCT((Data!$B$2:$B$51=G3)*(Data!$C$2:$C$51=F3)*(Data!$H$2:$H$51))","v":244.2},null,"The West",{"$f":"INDEX(Data!$B$2:$B$51,MATCH(1,INDEX((Data!$C$2:$C$51=J3)*(Data!$S$2:$S$51=A3),0),0))","v":"California"},{"$f":"SUMPRODUCT((Data!$B$2:$B$51=K3)*(Data!$C$2:$C$51=J3)*(Data!$I$2:$I$51))","v":292563574000},null,"The West",{"$f":"INDEX(Data!$B$2:$B$51,MATCH(1,INDEX((Data!$C$2:$C$51=N3)*(Data!$T$2:$T$51=A3),0),0))","v":"California"},{"$f":"SUMPRODUCT((Data!$B$2:$B$51=O3)*(Data!$C$2:$C$51=N3)*(Data!$J$2:$J$51))","v":435914805277.5},null,"The West",{"$f":"INDEX(Data!$B$2:$B$51,MATCH(1,INDEX((Data!$C$2:$C$51=R3)*(Data!$U$2:$U$51=A3),0),0))","v":"Nevada"},{"$f":"SUMPRODUCT((Data!$B$2:$B$51=S3)*(Data!$C$2:$C$51=R3)*(Data!$K$2:$K$51))","v":9.3000000000000013E-2}]
[2,"The West",{"$f":"INDEX(Data!$B$2:$B$51,MATCH(1,INDEX((Data!$C$2:$C$51=B4)*(Data!$Q$2:$Q$51=A4),0),0))","v":"Washington"},{"$f":"SUMPRODUCT((Data!$B$2:$B$51=C4)*(Data!$C$2:$C$51=B4)*(Data!$D$2:$D$51))","v":6897012},null,"The West",{"$f":"INDEX(Data!$B$2:$B$51,MATCH(1,INDEX((Data!$C$2:$C$51=F4)*(Data!$R$2:$R$51=A4),0),0))","v":"Hawaii"},{"$f":"SUMPRODUCT((Data!$B$2:$B$51=G4)*(Data!$C$2:$C$51=F4)*(Data!$H$2:$H$51))","v":216.8},null,"The West",{"$f":"INDEX(Data!$B$2:$B$51,MATCH(1,INDEX((Data!$C$2:$C$51=J4)*(Data!$S$2:$S$51=A4),0),0))","v":"Washington"},{"$f":"SUMPRODUCT((Data!$B$2:$B$51=K4)*(Data!$C$2:$C$51=J4)*(Data!$I$2:$I$51))","v":52443862000},null,"The West",{"$f":"INDEX(Data!$B$2:$B$51,MATCH(1,INDEX((Data!$C$2:$C$51=N4)*(Data!$T$2:$T$51=A4),0),0))","v":"Washington"},{"$f":"SUMPRODUCT((Data!$B$2:$B$51=O4)*(Data!$C$2:$C$51=N4)*(Data!$J$2:$J$51))","v":78545396912.5},null,"The West",{"$f":"INDEX(Data!$B$2:$B$51,MATCH(1,INDEX((Data!$C$2:$C$51=R4)*(Data!$U$2:$U$51=A4),0),0))","v":"California"},{"$f":"SUMPRODUCT((Data!$B$2:$B$51=S4)*(Data!$C$2:$C$51=R4)*(Data!$K$2:$K$51))","v":8.6999999999999994E-2}]
[3,"The West",{"$f":"INDEX(Data!$B$2:$B$51,MATCH(1,INDEX((Data!$C$2:$C$51=B5)*(Data!$Q$2:$Q$51=A5),0),0))","v":"Arizona"},{"$f":"SUMPRODUCT((Data!$B$2:$B$51=C5)*(Data!$C$2:$C$51=B5)*(Data!$D$2:$D$51))","v":6553255},null,"The West",{"$f":"INDEX(Data!$B$2:$B$51,MATCH(1,INDEX((Data!$C$2:$C$51=F5)*(Data!$R$2:$R$51=A5),0),0))","v":"Washington"},{"$f":"SUMPRODUCT((Data!$B$2:$B$51=G5)*(Data!$C$2:$C$51=F5)*(Data!$H$2:$H$51))","v":102.6},null,"The West",{"$f":"INDEX(Data!$B$2:$B$51,MATCH(1,INDEX((Data!$C$2:$C$51=J5)*(Data!$S$2:$S$51=A5),0),0))","v":"Colorado"},{"$f":"SUMPRODUCT((Data!$B$2:$B$51=K5)*(Data!$C$2:$C$51=J5)*(Data!$I$2:$I$51))","v":41252701000},null,"The West",{"$f":"INDEX(Data!$B$2:$B$51,MATCH(1,INDEX((Data!$C$2:$C$51=N5)*(Data!$T$2:$T$51=A5),0),0))","v":"Colorado"},{"$f":"SUMPRODUCT((Data!$B$2:$B$51=O5)*(Data!$C$2:$C$51=N5)*(Data!$J$2:$J$51))","v":58817715827.5},null,"The West",{"$f":"INDEX(Data!$B$2:$B$51,MATCH(1,INDEX((Data!$C$2:$C$51=R5)*(Data!$U$2:$U$51=A5),0),0))","v":"Arizona"},{"$f":"SUMPRODUCT((Data!$B$2:$B$51=S5)*(Data!$C$2:$C$51=R5)*(Data!$K$2:$K$51))","v":8.199999999999999E-2}]
[4,"The West",{"$f":"INDEX(Data!$B$2:$B$51,MATCH(1,INDEX((Data!$C$2:$C$51=B6)*(Data!$Q$2:$Q$51=A6),0),0))","v":"Colorado"},{"$f":"SUMPRODUCT((Data!$B$2:$B$51=C6)*(Data!$C$2:$C$51=B6)*(Data!$D$2:$D$51))","v":5187582},null,"The West",{"$f":"INDEX(Data!$B$2:$B$51,MATCH(1,INDEX((Data!$C$2:$C$51=F6)*(Data!$R$2:$R$51=A6),0),0))","v":"Arizona"},{"$f":"SUMPRODUCT((Data!$B$2:$B$51=G6)*(Data!$C$2:$C$51=F6)*(Data!$H$2:$H$51))","v":57.05},null,"The West",{"$f":"INDEX(Data!$B$2:$B$51,MATCH(1,INDEX((Data!$C$2:$C$51=J6)*(Data!$S$2:$S$51=A6),0),0))","v":"Arizona"},{"$f":"SUMPRODUCT((Data!$B$2:$B$51=K6)*(Data!$C$2:$C$51=J6)*(Data!$I$2:$I$51))","v":34850436000},null,"The West",{"$f":"INDEX(Data!$B$2:$B$51,MATCH(1,INDEX((Data!$C$2:$C$51=N6)*(Data!$T$2:$T$51=A6),0),0))","v":"Arizona"},{"$f":"SUMPRODUCT((Data!$B$2:$B$51=O6)*(Data!$C$2:$C$51=N6)*(Data!$J$2:$J$51))","v":74526795210},null,"The West",{"$f":"INDEX(Data!$B$2:$B$51,MATCH(1,INDEX((Data!$C$2:$C$51=R6)*(Data!$U$2:$U$51=A6),0),0))","v":"Oregon"},{"$f":"SUMPRODUCT((Data!$B$2:$B$51=S6)*(Data!$C$2:$C$51=R6)*(Data!$K$2:$K$51))","v":7.6999999999999999E-2}]
[5,"The West",{"$f":"INDEX(Data!$B$2:$B$51,MATCH(1,INDEX((Data!$C$2:$C$51=B7)*(Data!$Q$2:$Q$51=A7),0),0))","v":"Oregon"},{"$f":"SUMPRODUCT((Data!$B$2:$B$51=C7)*(Data!$C$2:$C$51=B7)*(Data!$D$2:$D$51))","v":3899353},null,"The West",{"$f":"INDEX(Data!$B$2:$B$51,MATCH(1,INDEX((Data!$C$2:$C$51=F7)*(Data!$R$2:$R$51=A7),0),0))","v":"Colorado"},{"$f":"SUMPRODUCT((Data!$B$2:$B$51=G7)*(Data!$C$2:$C$51=F7)*(Data!$H$2:$H$51))","v":49.33},null,"The West",{"$f":"INDEX(Data!$B$2:$B$51,MATCH(1,INDEX((Data!$C$2:$C$51=J7)*(Data!$S$2:$S$51=A7),0),0))","v":"Oregon"},{"$f":"SUMPRODUCT((Data!$B$2:$B$51=K7)*(Data!$C$2:$C$51=J7)*(Data!$I$2:$I$51))","v":22716602000},null,"The West",{"$f":"INDEX(Data!$B$2:$B$51,MATCH(1,INDEX((Data!$C$2:$C$51=N7)*(Data!$T$2:$T$51=A7),0),0))","v":"Oregon"},{"$f":"SUMPRODUCT((Data!$B$2:$B$51=O7)*(Data!$C$2:$C$51=N7)*(Data!$J$2:$J$51))","v":44569946155},null,"The West",{"$f":"INDEX(Data!$B$2:$B$51,MATCH(1,INDEX((Data!$C$2:$C$51=R7)*(Data!$U$2:$U$51=A7),0),0))","v":"Washington"},{"$f":"SUMPRODUCT((Data!$B$2:$B$51=S7)*(Data!$C$2:$C$51=R7)*(Data!$K$2:$K$51))","v":7.0000000000000007E-2}]
[6,"The West",{"$f":"INDEX(Data!$B$2:$B$51,MATCH(1,INDEX((Data!$C$2:$C$51=B8)*(Data!$Q$2:$Q$51=A8),0),0))","v":"Utah"},{"$f":"SUMPRODUCT((Data!$B$2:$B$51=C8)*(Data!$C$2:$C$51=B8)*(Data!$D$2:$D$51))","v":2855287},null,"The West",{"$f":"INDEX(Data!$B$2:$B$51,MATCH(1,INDEX((Data!$C$2:$C$51=F8)*(Data!$R$2:$R$51=A8),0),0))","v":"Oregon"},{"$f":"SUMPRODUCT((Data!$B$2:$B$51=G8)*(Data!$C$2:$C$51=F8)*(Data!$H$2:$H$51))","v":40.33},null,"The West",{"$f":"INDEX(Data!$B$2:$B$51,MATCH(1,INDEX((Data!$C$2:$C$51=J8)*(Data!$S$2:$S$51=A8),0),0))","v":"Utah"},{"$f":"SUMPRODUCT((Data!$B$2:$B$51=K8)*(Data!$C$2:$C$51=J8)*(Data!$I$2:$I$51))","v":15642129000},null,"The West",{"$f":"INDEX(Data!$B$2:$B$51,MATCH(1,INDEX((Data!$C$2:$C$51=N8)*(Data!$T$2:$T$51=A8),0),0))","v":"Utah"},{"$f":"SUMPRODUCT((Data!$B$2:$B$51=O8)*(Data!$C$2:$C$51=N8)*(Data!$J$2:$J$51))","v":32148813620},null,"The West",{"$f":"INDEX(Data!$B$2:$B$51,MATCH(1,INDEX((Data!$C$2:$C$51=R8)*(Data!$U$2:$U$51=A8),0),0))","v":"Colorado"},{"$f":"SUMPRODUCT((Data!$B$2:$B$51=S8)*(Data!$C$2:$C$51=R8)*(Data!$K$2:$K$51))","v":6.8000000000000005E-2}]
[7,"The West",{"$f":"INDEX(Data!$B$2:$B$51,MATCH(1,INDEX((Data!$C$2:$C$51=B9)*(Data!$Q$2:$Q$51=A9),0),0))","v":"Nevada"},{"$f":"SUMPRODUCT((Data!$B$2:$B$51=C9)*(Data!$C$2:$C$51=B9)*(Data!$D$2:$D$51))","v":2758931},null,"The West",{"$f":"INDEX(Data!$B$2:$B$51,MATCH(1,INDEX((Data!$C$2:$C$51=F9)*(Data!$R$2:$R$51=A9),0),0))","v":"Utah"},{"$f":"SUMPRODUCT((Data!$B$2:$B$51=G9)*(Data!$C$2:$C$51=F9)*(Data!$H$2:$H$51))","v":34.299999999999997},null,"The West",{"$f":"INDEX(Data!$B$2:$B$51,MATCH(1,INDEX((Data!$C$2:$C$51=J9)*(Data!$S$2:$S$51=A9),0),0))","v":"Nevada"},{"$f":"SUMPRODUCT((Data!$B$2:$B$51=K9)*(Data!$C$2:$C$51=J9)*(Data!$I$2:$I$51))","v":13727425000},null,"The West",{"$f":"INDEX(Data!$B$2:$B$51,MATCH(1,INDEX((Data!$C$2:$C$51=N9)*(Data!$T$2:$T$51=A9),0),0))","v":"Nevada"},{"$f":"SUMPRODUCT((Data!$B$2:$B$51=O9)*(Data!$C$2:$C$51=N9)*(Data!$J$2:$J$51))","v":31418158765},null,"The West",{"$f":"INDEX(Data!$B$2:$B$51,MATCH(1,INDEX((Data!$C$2:$C$51=R9)*(Data!$U$2:$U$51=A9),0),0))","v":"Idaho"},{"$f":"SUMPRODUCT((Data!$B$2:$B$51=S9)*(Data!$C$2:$C$51=R9)*(Data!$K$2:$K$51))","v":6.7000000000000004E-2}]
[8,"The West",{"$f":"INDEX(Data!$B$2:$B$51,MATCH(1,INDEX((Data!$C$2:$C$51=B10)*(Data!$Q$2:$Q$51=A10),0),0))","v":"New Mexico"},{"$f":"SUMPRODUCT((Data!$B$2:$B$51=C10)*(Data!$C$2:$C$51=B10)*(Data!$D$2:$D$51))","v":2085538},null,"The West",{"$f":"INDEX(Data!$B$2:$B$51,MATCH(1,INDEX((Data!$C$2:$C$51=F10)*(Data!$R$2:$R$51=A10),0),0))","v":"Nevada"},{"$f":"SUMPRODUCT((Data!$B$2:$B$51=G10)*(Data!$C$2:$C$51=F10)*(Data!$H$2:$H$51))","v":24.8},null,"The West",{"$f":"INDEX(Data!$B$2:$B$51,MATCH(1,INDEX((Data!$C$2:$C$51=J10)*(Data!$S$2:$S$51=A10),0),0))","v":"New Mexico"},{"$f":"SUMPRODUCT((Data!$B$2:$B$51=K10)*(Data!$C$2:$C$51=J10)*(Data!$I$2:$I$51))","v":7866206000},null,"The West",{"$f":"INDEX(Data!$B$2:$B$51,MATCH(1,INDEX((Data!$C$2:$C$51=N10)*(Data!$T$2:$T$51=A10),0),0))","v":"New Mexico"},{"$f":"SUMPRODUCT((Data!$B$2:$B$51=O10)*(Data!$C$2:$C$51=N10)*(Data!$J$2:$J$51))","v":24111610215},null,"The West",{"$f":"INDEX(Data!$B$2:$B$51,MATCH(1,INDEX((Data!$C$2:$C$51=R10)*(Data!$U$2:$U$51=A10),0),0))","v":"New Mexico"},{"$f":"SUMPRODUCT((Data!$B$2:$B$51=S10)*(Data!$C$2:$C$51=R10)*(Data!$K$2:$K$51))","v":6.6000000000000003E-2}]
{"$rows_left_out":80}
{"sheet":"Summary","index":4,"n_rows":21,"n_cols":15,"rows_kept":21,"cut":false,"hidden":false,"merged":[]}
[null,true,null,{"$f":"IF(B1=TRUE,\"All Regions\",IF(B2=TRUE,\"The West\",IF(B3=TRUE,\"The Mid-West\",IF(B4=TRUE,\"The South\",IF(B5=TRUE,\"The North-East\",\"\")))))","v":"All Regions"}]
[null,false]
[null,false]
[null,false]
[null,false]
[]
[null,null,null,"TOP 5 by Metrics by State and Region"]
[]
[null,"Flag",null,"State","Population",null,null,null,null,null,null,"Flag",null,"State","% Unemployment"]
[1,null,{"$f":"INDEX(States!C$2:C$51,MATCH(D10,States!D$2:D$51,0),1)","v":"California"},{"$f":"Calcs!C55","v":"California"},{"$f":"Calcs!D55","v":38041430},null,null,null,null,null,null,null,{"$f":"INDEX(States!C$2:C$51,MATCH(N10,States!D$2:D$51,0),1)","v":"Nevada"},{"$f":"Calcs!S55","v":"Nevada"},{"$f":"Calcs!T55","v":9.3000000000000013E-2}]
{"$rows_left_out":11}