{"text_format":"1","workbook":"xlsx","n_sheets":5,"sheets":["List","SocialData","Data","Calcs","Dash"],"not_rendered":{"charts":8,"images":6,"macros":1,"external_links":0,"defined_names":3,"comments":1,"pivot_tables":0},"unopened":[],"bounds":{"document_bytes":16777216,"sheet_cells":100000,"rows_first":2000,"rows_last":500,"rows_between":2000,"halvings":0,"cell_chars":16384,"cell_head_chars":4096},"cells_cut":0,"cells_raw":0,"read":"whole","date_system":"1900"}

{"sheet":"List","index":0,"n_rows":21,"n_cols":2,"rows_kept":21,"cut":false,"hidden":false,"merged":[]}
["Country","Region"]
["United States","All Regions"]
["Germany","The West"]
["United Kingdom","The South"]
["France","The North-East"]
["Spain","The Mid-West"]
["Russia"]
["Greece"]
["Netherlands"]
["Brazil"]
{"$rows_left_out":12}
{"sheet":"SocialData","index":1,"n_rows":81,"n_cols":14,"rows_kept":81,"cut":false,"hidden":false,"merged":[]}
["Country","Year","Facebook","Twitter","Google +","Linkedin","YouTube","Page Views","Avg Visitors Per Day","Average Visit Duration","Returning Visitors","Year","Search Engines","% Split"]
["United States",2010,1033.8,775,1007,790,982,9459,25,1.25,5202,2010,"Google",0.6]
["Germany",2010,745,447,581,412,707,6816,18,1.27,3748,2010,"Bing",0.26]
["United Kingdom",2010,674.6,337,438,283,640,6172,16,1.29,3147,2010,"Other",0.14000000000000001]
["France",2010,796.2,597,776,587,756,7285,19,1.06,4298,2011,"Google",0.65]
["Spain",2010,1389.4,833,1124,895,2361,12713,34,1.08,6610,2011,"Bing",0.2]
["Russia",2010,551.20000000000005,413,557,390,937,5043,13,1.05,2773,2011,"Other",0.15]
["Greece",2010,307.40000000000003,230,310,168,522,2812,7,1.35,1096,2012,"Google",0.7]
["Netherlands",2010,743.80000000000007,632,853,657,1264,6805,18,1.35,3742,2012,"Bing",0.15]
["Brazil",2010,643.80000000000007,386,521,358,1094,5890,16,1.36,3239,2012,"Other",0.15]
{"$rows_left_out":72}
{"sheet":"Data","index":2,"n_rows":51,"n_cols":18,"rows_kept":51,"cut":false,"hidden":false,"merged":[]}
[null,"State","Region","Revenue 2010","Revenue 2011","Revenue 2012","Revenue 2013","Expenses 2010","Expenses 2011","Expenses 2012","Expenses 2013","Late Debtors","Staff","% of US","Staff Rank Reg","Rev Rank","Exp Rank","Late Debtors Rank Reg"]
[1,"California","The West",1787984.7286865602,2340508.5920000002,2410723.8497600006,2483045.5652528009,1089787.0131937501,1122480.6235895625,1156155.0422972494,1167716.592720222,8.6999999999999994E-2,244.2,0.1191,{"$f":"SUMPRODUCT((C$2:C$601=$C2)*(M$2:M$601>M2))+1","v":1},{"$f":"SUMPRODUCT(($C$2:$C$601=$C2)*(G$2:G$601>G2))+1","v":1},{"$f":"SUMPRODUCT(($C$2:$C$601=$C2)*(K$2:K$601>K2))+1","v":1},{"$f":"COUNTIFS($C:$C,$C2,$L:$L,\">\"&$L2)+COUNTIFS($C$2:$C2,$C2,$L$2:$L2,$L2)","v":2}]
[2,"Texas","The South",1676519.8460053997,2194598.7799999998,{"$f":"E3*0.95","v":2084868.8409999998},{"$f":"F3*1.03","v":2147414.9062299998},1174893.0068399999,{"$f":"H3*0.95","v":1116148.356498},{"$f":"I3*1.03","v":1149632.80719294},{"$f":"J3*1.01","v":1161129.1352648695},6.2E-2,98.07,8.0399999999999999E-2,9,{"$f":"SUMPRODUCT(($C$2:$C$601=$C3)*(G$2:G$601>G3))+1","v":1},{"$f":"SUMPRODUCT(($C$2:$C$601=$C3)*(K$2:K$601>K3))+1","v":1},{"$f":"COUNTIFS($C:$C,$C3,$L:$L,\">\"&$L3)+COUNTIFS($C$2:$C3,$C3,$L$2:$L3,$L3)","v":11}]
[3,"New York","The North-East",1536782.3509922,2011679.54,1911095.5629999998,{"$f":"F4*1.07","v":2044872.25241},904550.71048999997,859323.1749654999,{"$f":"I4*1.07","v":919475.797213085},{"$f":"J4*1.01","v":928670.5551852159},7.6999999999999999E-2,415.3,6.1899999999999997E-2,5,1,1,{"$f":"COUNTIFS($C:$C,$C4,$L:$L,\">\"&$L4)+COUNTIFS($C$2:$C4,$C4,$L$2:$L4,$L4)","v":4}]
[4,"Florida","The South",933901.63665550016,1222496.3500000001,1161371.5325,{"$f":"F5*1.07","v":1242667.539775},878247.13570999994,834334.77892449987,{"$f":"I5*1.07","v":892738.21344921493},{"$f":"J5*1.01","v":901665.59558370709},6.7000000000000004E-2,360.2,6.0100000000000001E-2,1,2,2,{"$f":"COUNTIFS($C:$C,$C5,$L:$L,\">\"&$L5)+COUNTIFS($C$2:$C5,$C5,$L$2:$L5,$L5)","v":8}]
[5,"Illinois","The Mid-West",950567.47242110013,1244312.27,1182096.6565,{"$f":"F6*1.07","v":1264843.4224550002},599136.98109999998,569180.13204499998,{"$f":"I6*1.07","v":609022.74128814996},{"$f":"J6*1.095","v":666879.90171052422},8.900000000000001E-2,231.9,4.1000000000000002E-2,2,1,1,{"$f":"COUNTIFS($C:$C,$C6,$L:$L,\">\"&$L6)+COUNTIFS($C$2:$C6,$C6,$L$2:$L6,$L6)","v":2}]
[6,"Pennsylvania","The North-East",832389.70153949992,1089615.1499999999,1035134.3924999998,{"$f":"F7*1.07","v":1107593.7999749999},593291.74225999997,563627.15514699998,{"$f":"I7*1.07","v":603081.05600729003},{"$f":"J7*0.8","v":482464.84480583202},7.4999999999999997E-2,285.3,4.0599999999999997E-2,6,3,2,{"$f":"COUNTIFS($C:$C,$C7,$L:$L,\">\"&$L7)+COUNTIFS($C$2:$C7,$C7,$L$2:$L7,$L7)","v":5}]
[7,"Ohio","The Mid-West",848682.50264680013,1110942.76,1055395.622,{"$f":"F8*0.95","v":1002625.8409},539223.28299000009,512262.11884050007,{"$f":"I8*0.95","v":486649.01289847505},{"$f":"J8*0.96","v":467183.05238253606},7.4999999999999997E-2,282.5,3.6900000000000002E-2,1,2,3,{"$f":"COUNTIFS($C:$C,$C8,$L:$L,\">\"&$L8)+COUNTIFS($C$2:$C8,$C8,$L$2:$L8,$L8)","v":3}]
[8,"Georgia","The South",500361.22430440004,654983.07999999996,{"$f":"E9*0.96","v":628783.75679999997},{"$f":"F9*0.95","v":597344.56895999995},453006.01010000001,{"$f":"H9*0.96","v":434885.76969599997},{"$f":"I9*0.95","v":413141.48121119995},{"$f":"J9*0.97","v":400747.23677486397},8.1000000000000003E-2,172.5,3.1E-2,4,5,4,{"$f":"COUNTIFS($C:$C,$C9,$L:$L,\">\"&$L9)+COUNTIFS($C$2:$C9,$C9,$L$2:$L9,$L9)","v":4}]
[9,"Michigan","The Mid-West",452324.16000939999,592101.57999999996,{"$f":"E10*0.97","v":574338.53259999992},{"$f":"F10*0.96","v":551364.99129599985},461773.86836000008,{"$f":"H10*0.97","v":447920.65230920009},{"$f":"I10*0.96","v":430003.82621683209},{"$f":"J10*1.095","v":470854.18970743113},0.09,174.8,3.1600000000000003E-2,4,4,2,{"$f":"COUNTIFS($C:$C,$C10,$L:$L,\">\"&$L10)+COUNTIFS($C$2:$C10,$C10,$L$2:$L10,$L10)","v":1}]
{"$rows_left_out":42}
{"sheet":"Calcs","index":3,"n_rows":97,"n_cols":25,"rows_kept":97,"cut":false,"hidden":false,"merged":[]}
["Top 10","Revenue Region","Revenue State","Revenue 10","Revenue 11","Revenue 12","Revenue 13","Expense Region","Expense State","Expenses 10","Expenses 11","Expenses 12","Expenses 13","Staff","State","FTE by City","Late Debt","State","Late Debt"]
[1,"The West",{"$f":"INDEX(Data!$B$2:$B$51,MATCH(1,INDEX((Data!$C$2:$C$51=B2)*(Data!$P$2:$P$51=A2),0),0))","v":"California"},{"$f":"SUMPRODUCT((Data!$B$2:$B$51=C2)*(Data!$C$2:$C$51=B2)*(Data!$D$2:$D$51))","v":1787984.7286865602},{"$f":"SUMPRODUCT((Data!$B$2:$B$51=$C2)*(Data!$C$2:$C$51=$B2)*(Data!E$2:E$51))","v":2340508.5920000002},{"$f":"SUMPRODUCT((Data!$B$2:$B$51=$C2)*(Data!$C$2:$C$51=$B2)*(Data!F$2:F$51))","v":2410723.8497600006},{"$f":"SUMPRODUCT((Data!$B$2:$B$51=$C2)*(Data!$C$2:$C$51=$B2)*(Data!G$2:G$51))","v":2483045.5652528009},"The West",{"$f":"INDEX(Data!$B$2:$B$51,MATCH(1,INDEX((Data!$C$2:$C$51=B2)*(Data!$Q$2:$Q$51=A2),0),0))","v":"California"},{"$f":"SUMPRODUCT((Data!$B$2:$B$51=$I2)*(Data!$C$2:$C$51=$H2)*(Data!H$2:H$51))","v":1089787.0131937501},{"$f":"SUMPRODUCT((Data!$B$2:$B$51=$I2)*(Data!$C$2:$C$51=$H2)*(Data!I$2:I$51))","v":1122480.6235895625},{"$f":"SUMPRODUCT((Data!$B$2:$B$51=$I2)*(Data!$C$2:$C$51=$H2)*(Data!J$2:J$51))","v":1156155.0422972494},{"$f":"SUMPRODUCT((Data!$B$2:$B$51=$I2)*(Data!$C$2:$C$51=$H2)*(Data!K$2:K$51))","v":1167716.592720222},"The West",{"$f":"INDEX(Data!$B$2:$B$51,MATCH(1,INDEX((Data!$C$2:$C$51=N2)*(Data!$O$2:$O$51=A2),0),0))","v":"California"},{"$f":"SUMPRODUCT((Data!$B$2:$B$51=O2)*(Data!$C$2:$C$51=N2)*(Data!$M$2:$M$51))","v":244.2},"The West",{"$f":"INDEX(Data!$B$2:$B$51,MATCH(1,INDEX((Data!$C$2:$C$51=Q2)*(Data!$R$2:$R$51=A2),0),0))","v":"Nevada"},{"$f":"SUMPRODUCT((Data!$B$2:$B$51=R2)*(Data!$C$2:$C$51=Q2)*(Data!$L$2:$L$51))","v":9.3000000000000013E-2}]
[2,"The West",{"$f":"INDEX(Data!$B$2:$B$51,MATCH(1,INDEX((Data!$C$2:$C$51=B3)*(Data!$P$2:$P$51=A3),0),0))","v":"Washington"},{"$f":"SUMPRODUCT((Data!$B$2:$B$51=C3)*(Data!$C$2:$C$51=B3)*(Data!$D$2:$D$51))","v":820326.88940400002},{"$f":"SUMPRODUCT((Data!$B$2:$B$51=$C3)*(Data!$C$2:$C$51=$B3)*(Data!E$2:E$51))","v":1048877.24},{"$f":"SUMPRODUCT((Data!$B$2:$B$51=$C3)*(Data!$C$2:$C$51=$B3)*(Data!F$2:F$51))","v":996433.37799999991},{"$f":"SUMPRODUCT((Data!$B$2:$B$51=$C3)*(Data!$C$2:$C$51=$B3)*(Data!G$2:G$51))","v":1066183.7144599999},"The West",{"$f":"INDEX(Data!$B$2:$B$51,MATCH(1,INDEX((Data!$C$2:$C$51=B3)*(Data!$Q$2:$Q$51=A3),0),0))","v":"Washington"},{"$f":"SUMPRODUCT((Data!$B$2:$B$51=$I3)*(Data!$C$2:$C$51=$H3)*(Data!H$2:H$51))","v":628363.1753},{"$f":"SUMPRODUCT((Data!$B$2:$B$51=$I3)*(Data!$C$2:$C$51=$H3)*(Data!I$2:I$51))","v":596945.01653499994},{"$f":"SUMPRODUCT((Data!$B$2:$B$51=$I3)*(Data!$C$2:$C$51=$H3)*(Data!J$2:J$51))","v":638731.16769244999},{"$f":"SUMPRODUCT((Data!$B$2:$B$51=$I3)*(Data!$C$2:$C$51=$H3)*(Data!K$2:K$51))","v":606794.60930782743},"The West",{"$f":"INDEX(Data!$B$2:$B$51,MATCH(1,INDEX((Data!$C$2:$C$51=N3)*(Data!$O$2:$O$51=A3),0),0))","v":"Hawaii"},{"$f":"SUMPRODUCT((Data!$B$2:$B$51=O3)*(Data!$C$2:$C$51=N3)*(Data!$M$2:$M$51))","v":216.8},"The West",{"$f":"INDEX(Data!$B$2:$B$51,MATCH(1,INDEX((Data!$C$2:$C$51=Q3)*(Data!$R$2:$R$51=A3),0),0))","v":"California"},{"$f":"SUMPRODUCT((Data!$B$2:$B$51=R3)*(Data!$C$2:$C$51=Q3)*(Data!$L$2:$L$51))","v":8.6999999999999994E-2}]
[3,"The West",{"$f":"INDEX(Data!$B$2:$B$51,MATCH(1,INDEX((Data!$C$2:$C$51=B4)*(Data!$P$2:$P$51=A4),0),0))","v":"Colorado"},{"$f":"SUMPRODUCT((Data!$B$2:$B$51=C4)*(Data!$C$2:$C$51=B4)*(Data!$D$2:$D$51))","v":645274.74904200004},{"$f":"SUMPRODUCT((Data!$B$2:$B$51=$C4)*(Data!$C$2:$C$51=$B4)*(Data!E$2:E$51))","v":825054.02},{"$f":"SUMPRODUCT((Data!$B$2:$B$51=$C4)*(Data!$C$2:$C$51=$B4)*(Data!F$2:F$51))","v":849805.64060000004},{"$f":"SUMPRODUCT((Data!$B$2:$B$51=$C4)*(Data!$C$2:$C$51=$B4)*(Data!G$2:G$51))","v":807315.35857000004},"The West",{"$f":"INDEX(Data!$B$2:$B$51,MATCH(1,INDEX((Data!$C$2:$C$51=B4)*(Data!$Q$2:$Q$51=A4),0),0))","v":"Arizona"},{"$f":"SUMPRODUCT((Data!$B$2:$B$51=$I4)*(Data!$C$2:$C$51=$H4)*(Data!H$2:H$51))","v":596214.36167999997},{"$f":"SUMPRODUCT((Data!$B$2:$B$51=$I4)*(Data!$C$2:$C$51=$H4)*(Data!I$2:I$51))","v":614100.79253039998},{"$f":"SUMPRODUCT((Data!$B$2:$B$51=$I4)*(Data!$C$2:$C$51=$H4)*(Data!J$2:J$51))","v":583395.75290387997},{"$f":"SUMPRODUCT((Data!$B$2:$B$51=$I4)*(Data!$C$2:$C$51=$H4)*(Data!K$2:K$51))","v":466716.60232310399},"The West",{"$f":"INDEX(Data!$B$2:$B$51,MATCH(1,INDEX((Data!$C$2:$C$51=N4)*(Data!$O$2:$O$51=A4),0),0))","v":"Washington"},{"$f":"SUMPRODUCT((Data!$B$2:$B$51=O4)*(Data!$C$2:$C$51=N4)*(Data!$M$2:$M$51))","v":102.6},"The West",{"$f":"INDEX(Data!$B$2:$B$51,MATCH(1,INDEX((Data!$C$2:$C$51=Q4)*(Data!$R$2:$R$51=A4),0),0))","v":"Arizona"},{"$f":"SUMPRODUCT((Data!$B$2:$B$51=R4)*(Data!$C$2:$C$51=Q4)*(Data!$L$2:$L$51))","v":8.199999999999999E-2}]
[4,"The West",{"$f":"INDEX(Data!$B$2:$B$51,MATCH(1,INDEX((Data!$C$2:$C$51=B5)*(Data!$P$2:$P$51=A5),0),0))","v":"Arizona"},{"$f":"SUMPRODUCT((Data!$B$2:$B$51=C5)*(Data!$C$2:$C$51=B5)*(Data!$D$2:$D$51))","v":545130.51991200005},{"$f":"SUMPRODUCT((Data!$B$2:$B$51=$C5)*(Data!$C$2:$C$51=$B5)*(Data!E$2:E$51))","v":697008.72},{"$f":"SUMPRODUCT((Data!$B$2:$B$51=$C5)*(Data!$C$2:$C$51=$B5)*(Data!F$2:F$51))","v":717918.98159999994},{"$f":"SUMPRODUCT((Data!$B$2:$B$51=$C5)*(Data!$C$2:$C$51=$B5)*(Data!G$2:G$51))","v":682023.03251999989},"The West",{"$f":"INDEX(Data!$B$2:$B$51,MATCH(1,INDEX((Data!$C$2:$C$51=B5)*(Data!$Q$2:$Q$51=A5),0),0))","v":"Oregon"},{"$f":"SUMPRODUCT((Data!$B$2:$B$51=$I5)*(Data!$C$2:$C$51=$H5)*(Data!H$2:H$51))","v":356559.56923999998},{"$f":"SUMPRODUCT((Data!$B$2:$B$51=$I5)*(Data!$C$2:$C$51=$H5)*(Data!I$2:I$51))","v":342297.18647039996},{"$f":"SUMPRODUCT((Data!$B$2:$B$51=$I5)*(Data!$C$2:$C$51=$H5)*(Data!J$2:J$51))","v":352566.10206451197},{"$f":"SUMPRODUCT((Data!$B$2:$B$51=$I5)*(Data!$C$2:$C$51=$H5)*(Data!K$2:K$51))","v":338463.45798193145},"The West",{"$f":"INDEX(Data!$B$2:$B$51,MATCH(1,INDEX((Data!$C$2:$C$51=N5)*(Data!$O$2:$O$51=A5),0),0))","v":"Arizona"},{"$f":"SUMPRODUCT((Data!$B$2:$B$51=O5)*(Data!$C$2:$C$51=N5)*(Data!$M$2:$M$51))","v":57.05},"The West",{"$f":"INDEX(Data!$B$2:$B$51,MATCH(1,INDEX((Data!$C$2:$C$51=Q5)*(Data!$R$2:$R$51=A5),0),0))","v":"Oregon"},{"$f":"SUMPRODUCT((Data!$B$2:$B$51=R5)*(Data!$C$2:$C$51=Q5)*(Data!$L$2:$L$51))","v":7.6999999999999999E-2}]
[5,"The West",{"$f":"INDEX(Data!$B$2:$B$51,MATCH(1,INDEX((Data!$C$2:$C$51=B6)*(Data!$P$2:$P$51=A6),0),0))","v":"Montana"},{"$f":"SUMPRODUCT((Data!$B$2:$B$51=C6)*(Data!$C$2:$C$51=B6)*(Data!$D$2:$D$51))","v":552798.21978000004},{"$f":"SUMPRODUCT((Data!$B$2:$B$51=$C6)*(Data!$C$2:$C$51=$B6)*(Data!E$2:E$51))","v":686024.1},{"$f":"SUMPRODUCT((Data!$B$2:$B$51=$C6)*(Data!$C$2:$C$51=$B6)*(Data!F$2:F$51))","v":665443.37699999986},{"$f":"SUMPRODUCT((Data!$B$2:$B$51=$C6)*(Data!$C$2:$C$51=$B6)*(Data!G$2:G$51))","v":645480.07568999985},"The West",{"$f":"INDEX(Data!$B$2:$B$51,MATCH(1,INDEX((Data!$C$2:$C$51=B6)*(Data!$Q$2:$Q$51=A6),0),0))","v":"Colorado"},{"$f":"SUMPRODUCT((Data!$B$2:$B$51=$I6)*(Data!$C$2:$C$51=$H6)*(Data!H$2:H$51))","v":235270.86330999999},{"$f":"SUMPRODUCT((Data!$B$2:$B$51=$I6)*(Data!$C$2:$C$51=$H6)*(Data!I$2:I$51))","v":242328.98920929999},{"$f":"SUMPRODUCT((Data!$B$2:$B$51=$I6)*(Data!$C$2:$C$51=$H6)*(Data!J$2:J$51))","v":230212.53974883497},{"$f":"SUMPRODUCT((Data!$B$2:$B$51=$I6)*(Data!$C$2:$C$51=$H6)*(Data!K$2:K$51))","v":221004.03815888157},"The West",{"$f":"INDEX(Data!$B$2:$B$51,MATCH(1,INDEX((Data!$C$2:$C$51=N6)*(Data!$O$2:$O$51=A6),0),0))","v":"Colorado"},{"$f":"SUMPRODUCT((Data!$B$2:$B$51=O6)*(Data!$C$2:$C$51=N6)*(Data!$M$2:$M$51))","v":49.33},"The West",{"$f":"INDEX(Data!$B$2:$B$51,MATCH(1,INDEX((Data!$C$2:$C$51=Q6)*(Data!$R$2:$R$51=A6),0),0))","v":"Washington"},{"$f":"SUMPRODUCT((Data!$B$2:$B$51=R6)*(Data!$C$2:$C$51=Q6)*(Data!$L$2:$L$51))","v":7.0000000000000007E-2}]
[6,"The West",{"$f":"INDEX(Data!$B$2:$B$51,MATCH(1,INDEX((Data!$C$2:$C$51=B7)*(Data!$P$2:$P$51=A7),0),0))","v":"Oregon"},{"$f":"SUMPRODUCT((Data!$B$2:$B$51=C7)*(Data!$C$2:$C$51=B7)*(Data!$D$2:$D$51))","v":177666.544242},{"$f":"SUMPRODUCT((Data!$B$2:$B$51=$C7)*(Data!$C$2:$C$51=$B7)*(Data!E$2:E$51))","v":227166.02},{"$f":"SUMPRODUCT((Data!$B$2:$B$51=$C7)*(Data!$C$2:$C$51=$B7)*(Data!F$2:F$51))","v":218079.3792},{"$f":"SUMPRODUCT((Data!$B$2:$B$51=$C7)*(Data!$C$2:$C$51=$B7)*(Data!G$2:G$51))","v":224621.760576},"The West",{"$f":"INDEX(Data!$B$2:$B$51,MATCH(1,INDEX((Data!$C$2:$C$51=B7)*(Data!$Q$2:$Q$51=A7),0),0))","v":"Utah"},{"$f":"SUMPRODUCT((Data!$B$2:$B$51=$I7)*(Data!$C$2:$C$51=$H7)*(Data!H$2:H$51))","v":128595.25448},{"$f":"SUMPRODUCT((Data!$B$2:$B$51=$I7)*(Data!$C$2:$C$51=$H7)*(Data!I$2:I$51))","v":132453.11211440002},{"$f":"SUMPRODUCT((Data!$B$2:$B$51=$I7)*(Data!$C$2:$C$51=$H7)*(Data!J$2:J$51))","v":136426.70547783203},{"$f":"SUMPRODUCT((Data!$B$2:$B$51=$I7)*(Data!$C$2:$C$51=$H7)*(Data!K$2:K$51))","v":140519.50664216699},"The West",{"$f":"INDEX(Data!$B$2:$B$51,MATCH(1,INDEX((Data!$C$2:$C$51=N7)*(Data!$O$2:$O$51=A7),0),0))","v":"Oregon"},{"$f":"SUMPRODUCT((Data!$B$2:$B$51=O7)*(Data!$C$2:$C$51=N7)*(Data!$M$2:$M$51))","v":40.33},"The West",{"$f":"INDEX(Data!$B$2:$B$51,MATCH(1,INDEX((Data!$C$2:$C$51=Q7)*(Data!$R$2:$R$51=A7),0),0))","v":"Colorado"},{"$f":"SUMPRODUCT((Data!$B$2:$B$51=R7)*(Data!$C$2:$C$51=Q7)*(Data!$L$2:$L$51))","v":6.8000000000000005E-2}]
[7,"The West",{"$f":"INDEX(Data!$B$2:$B$51,MATCH(1,INDEX((Data!$C$2:$C$51=B8)*(Data!$P$2:$P$51=A8),0),0))","v":"Idaho"},{"$f":"SUMPRODUCT((Data!$B$2:$B$51=C8)*(Data!$C$2:$C$51=B8)*(Data!$D$2:$D$51))","v":184266.07326000003},{"$f":"SUMPRODUCT((Data!$B$2:$B$51=$C8)*(Data!$C$2:$C$51=$B8)*(Data!E$2:E$51))","v":228674.69999999998},{"$f":"SUMPRODUCT((Data!$B$2:$B$51=$C8)*(Data!$C$2:$C$51=$B8)*(Data!F$2:F$51))","v":221814.45899999997},{"$f":"SUMPRODUCT((Data!$B$2:$B$51=$C8)*(Data!$C$2:$C$51=$B8)*(Data!G$2:G$51))","v":215160.02522999997},"The West",{"$f":"INDEX(Data!$B$2:$B$51,MATCH(1,INDEX((Data!$C$2:$C$51=B8)*(Data!$Q$2:$Q$51=A8),0),0))","v":"Nevada"},{"$f":"SUMPRODUCT((Data!$B$2:$B$51=$I8)*(Data!$C$2:$C$51=$H8)*(Data!H$2:H$51))","v":125672.63506},{"$f":"SUMPRODUCT((Data!$B$2:$B$51=$I8)*(Data!$C$2:$C$51=$H8)*(Data!I$2:I$51))","v":129442.81411180001},{"$f":"SUMPRODUCT((Data!$B$2:$B$51=$I8)*(Data!$C$2:$C$51=$H8)*(Data!J$2:J$51))","v":133326.09853515401},{"$f":"SUMPRODUCT((Data!$B$2:$B$51=$I8)*(Data!$C$2:$C$51=$H8)*(Data!K$2:K$51))","v":137325.88149120865},"The West",{"$f":"INDEX(Data!$B$2:$B$51,MATCH(1,INDEX((Data!$C$2:$C$51=N8)*(Data!$O$2:$O$51=A8),0),0))","v":"Utah"},{"$f":"SUMPRODUCT((Data!$B$2:$B$51=O8)*(Data!$C$2:$C$51=N8)*(Data!$M$2:$M$51))","v":34.299999999999997},"The West",{"$f":"INDEX(Data!$B$2:$B$51,MATCH(1,INDEX((Data!$C$2:$C$51=Q8)*(Data!$R$2:$R$51=A8),0),0))","v":"Idaho"},{"$f":"SUMPRODUCT((Data!$B$2:$B$51=R8)*(Data!$C$2:$C$51=Q8)*(Data!$L$2:$L$51))","v":6.7000000000000004E-2}]
[8,"The West",{"$f":"INDEX(Data!$B$2:$B$51,MATCH(1,INDEX((Data!$C$2:$C$51=B9)*(Data!$P$2:$P$51=A9),0),0))","v":"New Mexico"},{"$f":"SUMPRODUCT((Data!$B$2:$B$51=C9)*(Data!$C$2:$C$51=B9)*(Data!$D$2:$D$51))","v":182700.50055599998},{"$f":"SUMPRODUCT((Data!$B$2:$B$51=$C9)*(Data!$C$2:$C$51=$B9)*(Data!E$2:E$51))","v":235986.18},{"$f":"SUMPRODUCT((Data!$B$2:$B$51=$C9)*(Data!$C$2:$C$51=$B9)*(Data!F$2:F$51))","v":224186.87099999998},{"$f":"SUMPRODUCT((Data!$B$2:$B$51=$C9)*(Data!$C$2:$C$51=$B9)*(Data!G$2:G$51))","v":212977.52744999999},"The West",{"$f":"INDEX(Data!$B$2:$B$51,MATCH(1,INDEX((Data!$C$2:$C$51=B9)*(Data!$Q$2:$Q$51=A9),0),0))","v":"New Mexico"},{"$f":"SUMPRODUCT((Data!$B$2:$B$51=$I9)*(Data!$C$2:$C$51=$H9)*(Data!H$2:H$51))","v":96446.440860000002},{"$f":"SUMPRODUCT((Data!$B$2:$B$51=$I9)*(Data!$C$2:$C$51=$H9)*(Data!I$2:I$51))","v":91624.118816999995},{"$f":"SUMPRODUCT((Data!$B$2:$B$51=$I9)*(Data!$C$2:$C$51=$H9)*(Data!J$2:J$51))","v":87042.912876149989},{"$f":"SUMPRODUCT((Data!$B$2:$B$51=$I9)*(Data!$C$2:$C$51=$H9)*(Data!K$2:K$51))","v":82690.767232342492},"The West",{"$f":"INDEX(Data!$B$2:$B$51,MATCH(1,INDEX((Data!$C$2:$C$51=N9)*(Data!$O$2:$O$51=A9),0),0))","v":"Nevada"},{"$f":"SUMPRODUCT((Data!$B$2:$B$51=O9)*(Data!$C$2:$C$51=N9)*(Data!$M$2:$M$51))","v":24.8},"The West",{"$f":"INDEX(Data!$B$2:$B$51,MATCH(1,INDEX((Data!$C$2:$C$51=Q9)*(Data!$R$2:$R$51=A9),0),0))","v":"New Mexico"},{"$f":"SUMPRODUCT((Data!$B$2:$B$51=R9)*(Data!$C$2:$C$51=Q9)*(Data!$L$2:$L$51))","v":6.6000000000000003E-2}]
[9,"The West",{"$f":"INDEX(Data!$B$2:$B$51,MATCH(1,INDEX((Data!$C$2:$C$51=B10)*(Data!$P$2:$P$51=A10),0),0))","v":"Hawaii"},{"$f":"SUMPRODUCT((Data!$B$2:$B$51=C10)*(Data!$C$2:$C$51=B10)*(Data!$D$2:$D$51))","v":157410.88657200002},{"$f":"SUMPRODUCT((Data!$B$2:$B$51=$C10)*(Data!$C$2:$C$51=$B10)*(Data!E$2:E$51))","v":195347.34},{"$f":"SUMPRODUCT((Data!$B$2:$B$51=$C10)*(Data!$C$2:$C$51=$B10)*(Data!F$2:F$51))","v":213905.33730000001},{"$f":"SUMPRODUCT((Data!$B$2:$B$51=$C10)*(Data!$C$2:$C$51=$B10)*(Data!G$2:G$51))","v":207488.17718100001},"The West",{"$f":"INDEX(Data!$B$2:$B$51,MATCH(1,INDEX((Data!$C$2:$C$51=B10)*(Data!$Q$2:$Q$51=A10),0),0))","v":"Hawaii"},{"$f":"SUMPRODUCT((Data!$B$2:$B$51=$I10)*(Data!$C$2:$C$51=$H10)*(Data!H$2:H$51))","v":62836.31753},{"$f":"SUMPRODUCT((Data!$B$2:$B$51=$I10)*(Data!$C$2:$C$51=$H10)*(Data!I$2:I$51))","v":68805.767695350005},{"$f":"SUMPRODUCT((Data!$B$2:$B$51=$I10)*(Data!$C$2:$C$51=$H10)*(Data!J$2:J$51))","v":75342.31562640825},{"$f":"SUMPRODUCT((Data!$B$2:$B$51=$I10)*(Data!$C$2:$C$51=$H10)*(Data!K$2:K$51))","v":73082.046157616001},"The West",{"$f":"INDEX(Data!$B$2:$B$51,MATCH(1,INDEX((Data!$C$2:$C$51=N10)*(Data!$O$2:$O$51=A10),0),0))","v":"Idaho"},{"$f":"SUMPRODUCT((Data!$B$2:$B$51=O10)*(Data!$C$2:$C$51=N10)*(Data!$M$2:$M$51))","v":19.5},"The West",{"$f":"INDEX(Data!$B$2:$B$51,MATCH(1,INDEX((Data!$C$2:$C$51=Q10)*(Data!$R$2:$R$51=A10),0),0))","v":"Alaska"},{"$f":"SUMPRODUCT((Data!$B$2:$B$51=R10)*(Data!$C$2:$C$51=Q10)*(Data!$L$2:$L$51))","v":6.5000000000000002E-2}]
{"$rows_left_out":88}
{"sheet":"Dash","index":4,"n_rows":45,"n_cols":20,"rows_kept":45,"cut":false,"hidden":false,"merged":[]}
[null,2010]
[null,{"$f":"$B$1 & \" Rev Exp Split\"","v":"2010 Rev Exp Split"}]
[]
[]
[]
[]
[]
[]
[]
[null,null,null,null,null,null,null,null,null,null,null,null,null,2010,2011,2012,2013]
{"$rows_left_out":35}